F6Economics.owl
type: Ontology
version info: Version 0.01. First Version.
description: Ontology of Economic terms needed in clustered space missions. Ontology Created for the F6 DARPA program by the Team "F6: A Design Tool for Stably Adaptable Systems." PI - Pamela E. Clark (Catholic University of America) This program involves designing missions using clusters of spacecraft modules
rights: Copyright (c) 2011, Catholic University of America. Developed with the sponsorship of the Defense Advanced Research Projects Agency (DARPA). Permission is hereby granted, free of charge, to any person obtaining a copy of this data, including any software or models in source or binary form, specifications, algorithms, and documentation (collectively "the Data"), to deal in the Data without restriction, including without limitation the rights to use, copy, modify, merge, publish, distribute, sublicense, and/or sell copies of the Data, and to permit persons to whom the Data is furnished to do so, subject to the following conditions: The above copyright notice and this permission notice shall be included in all copies or substantial portions of the Data. THE DATA IS PROVIDED "AS IS", WITHOUT WARRANTY OF ANY KIND, EXPRESS OR IMPLIED, INCLUDING BUT NOT LIMITED TO THE WARRANTIES OF MERCHANTABILITY, FITNESS FOR A PARTICULAR PURPOSE AND NONINFRINGEMENT. IN NO EVENT SHALL THE AUTHORS, SPONSORS, DEVELOPERS, CONTRIBUTORS, OR COPYRIGHT HOLDERS BE LIABLE FOR ANY CLAIM, DAMAGES OR OTHER LIABILITY, WHETHER IN AN ACTION OF CONTRACT, TORT OR OTHERWISE, ARISING FROM, OUT OF OR IN CONNECTION WITH THE DATA OR THE USE OR OTHER DEALINGS IN THE DATA.
creator: Ed Shaya (U. of Maryland)
date: November 10, 2011
imports: F6 root.owl

Agreement
type: Class
subclass of: InformationContentEntity
comment: A specification of the details of a particular Transaction.

Asset
type: Class
subclass of: Infrastructure
comment: Anything of value owned by a person or institution

BidPrice
type: Class
subclass of: Price
comment: The highest value an agent is will to pay for an good or stock

Budget
type: Class
subclass of: Analysis
comment: A summary of intended expenditures along with proposals for how to meet them

Collaborators
type: Class
subclass of: Agent
comment: Agents banded together for a goal.

Commitment
type: Class
subclass of: Agreement
comment: Obligation to make a transaction at a specified time.

Condition
type: Class
subclass of: TaskSpecification
comment: Limits on parameters that must hold for a transaction to proceed.

Copyright
type: Class
subclass of: InformationBearingEntity
comment: A legal right (usually of the author or composer or publisher of a work) to exclusive publication production, sale, distribution of some work.

CostBenefitAnalysis
type: Class
subclass of: EconomicAnalysis
comment: A technique that assesses projects through a comparison between their costs and benefits,

CostCurve
type: Class
subclass of: Cost
comment: a graph of total costs of production as a function of total quantity produced.

CostModel
type: Class
subclass of: EconomicAnalysis
comment: Cost estimation models are mathematical algorithms or parametric equations used to estimate the costs of a product or project.

CurrencyAppreciation
type: Class
subclass of: FinancialEvent
comment: An increase in the value of one currency relative to another currency.

Demand
type: Class
subclass of: MarketForce
comment: The desire to own a thing, the ability to pay for it, and the willingness to pay[

EconomicValue
type: Class
subclass of: Property
comment: the monetary worth of something

ExcessCapacity
type: Class
subclass of: Supply
comment: capacity over and above that which is needed to meet peak planned or expected demand.

ExcessDemand
type: Class
subclass of: Demand
comment: the situation in which the quantity demanded at a given price exceeds the quantity supplied.

ExchangeRate
type: Class
subclass of: Price
comment: The price of one currency stated in terms of another currency, when exchanged.

FinancialRisk
type: Class
subclass of: Risk
comment: The chance that a financial investment will lose value

FixedCost
type: Class
subclass of: Cost
comment: a cost that does not vary with the number of goods produced (eg land and rent)

Good
type: Class
subclass of: Materiel
comment: A thing that is bought and sold

Investment
type: Class
subclass of: Event
comment: the outlay of money usually for income or profit

Manufacturer
type: Class
subclass of: Company
comment: Company that manufactures a good

MarginalRevenue
type: Class
subclass of: Revenue
comment: The revenue a company gains in producing one additional unit of a good.

MarketForce
type: Class
subclass of: Property
comment: factors that affect the price and/or supply of goods

MarketPrice
type: Class
subclass of: Price
comment: Prices established by demand and supply in a free-market economy.

MarketShare
type: Class
subclass of: Property
comment: the percentage of the market for a product or service that a company supplies

Nation
type: Class
subclass of: GeopoliticalEntity
comment: A sovereign country

Obsolescence
type: Class
subclass of: Property
comment: Attribute of losing value because change in world has reduced need for something.

Price
type: Class
subclass of: Property
comment: The monetary or real value of a resource, commodity, or service.

Provider
type: Class
subclass of: Company
comment: A company that provides a service.

Risk
type: Class
subclass of: Metric
comment: A possible negative outcome, e.g. a danger. Takes dataobject inPercent to provide likelihood of this outcome.

Stakeholder
type: Class
subclass of: Agent
comment: one who is involved in or affected by a course of action

Supply
type: Class
subclass of: MarketForce
comment: The ability of one or more suppliers to manufacture or deliver from storage a good or providers to provide a service.

Transaction
type: Class
subclass of: Activity
comment: Act of trading goods, cash, or services between Agents or Collaborators